Target
5-hydroxytryptamine receptor 2A
Ligand
BDBM82087
Substrate
Meas. Tech.
ChEMBL_1442874 (CHEMBL3377152)
EC50
0.503000±n/a nM
Citation
 Blough, BELandavazo, APartilla, JSDecker, AMPage, KMBaumann, MHRothman, RB Alpha-ethyltryptamines as dual dopamine-serotonin releasers. Bioorg Med Chem Lett 24:4754-8 (2014)  
Target
Name:
5-hydroxytryptamine receptor 2A
Synonyms:
5-HT-2 5-HT2A 5-hydroxytryptamine receptor 2A (5HT-2A) 5HT2A_HUMAN HTR2A | Serotonin receptor 2A
Type:
undefined
Mol. Mass.:
52607.65
Organism:
Homo sapiens (Human)
Description:
P28223
Residue:
471
  
Inhibitor
Name:
BDBM82087
Synonyms:
2-(5-methoxy-1H-indol-3-yl)ethanamine 5-Methoxytryptamine hydrochloride tryptamine, 5-Methoxy
Type:
Small organic molecule
Emp. Form.:
C11H14N2O
Mol. Mass.:
190.2417
SMILES:
COc1ccc2[nH]cc(CCN)c2c1
: