Target
Transporter
Ligand
BDBM50025214
Substrate
Meas. Tech.
ChEMBL_1442878 (CHEMBL3377156)
IC50
3862±n/a nM
Citation
 Blough, BELandavazo, APartilla, JSDecker, AMPage, KMBaumann, MHRothman, RB Alpha-ethyltryptamines as dual dopamine-serotonin releasers. Bioorg Med Chem Lett 24:4754-8 (2014)  
Target
Name:
Transporter
Synonyms:
Monoamine transporters; Norepininephrine & dopamine | Norepinephrine Monoamine transporters
Type:
PROTEIN
Mol. Mass.:
66787.87
Organism:
Rattus norvegicus
Description:
ChEMBL_1463061
Residue:
597
  
Inhibitor
Name:
BDBM50025214
Synonyms:
CHEMBL3330640
Type:
Small organic molecule
Emp. Form.:
C12H16N2
Mol. Mass.:
188.2688
SMILES:
CCNCCc1c[nH]c2ccccc12
: