Target
Mu-type opioid receptor
Ligand
BDBM50025235
Substrate
Meas. Tech.
ChEMBL_1431190 (CHEMBL3385053)
Ki
362±n/a nM
Citation
 Polepally, PRHuben, KVardy, ESetola, VMosier, PDRoth, BLZjawiony, JK Michael acceptor approach to the design of new salvinorin A-based high affinity ligands for the kappa-opioid receptor. Eur J Med Chem 85:818-29 (2014)  
Target
Name:
Mu-type opioid receptor
Synonyms:
M-OR-1 MOR-1 MUOR1 Mu opiate receptor OPRM1 hMOP | mu-type opioid receptor isoform MOR-1
Type:
G Protein-Coupled Receptor (GPCR)
Mol. Mass.:
44789.51
Organism:
Homo sapiens (Human)
Description:
P35372
Residue:
400
  
Inhibitor
Name:
BDBM50025235
Synonyms:
CHEMBL3330665
Type:
Small organic molecule
Emp. Form.:
C26H32O8
Mol. Mass.:
472.5275
SMILES:
[H][C@@]12CC[C@@]3(C)[C@@H](C[C@H](OC(=O)CC(C)=C)C(=O)[C@]3([H])[C@@]1(C)C[C@H](OC2=O)c1ccoc1)C(=O)OC
: