Target
Carbonic anhydrase 2
Ligand
BDBM50025625
Substrate
Meas. Tech.
ChEMBL_1431198 (CHEMBL3385061)
Ki
114±n/a nM
Citation
 Alafeefy, AMCeruso, MAl-Tamimi, AMDel Prete, SCapasso, CSupuran, CT Quinazoline-sulfonamides with potent inhibitory activity against thea-carbonic anhydrase from Vibrio cholerae. Bioorg Med Chem 22:5133-40 (2014)  
Target
Name:
Carbonic anhydrase 2
Synonyms:
CA-II CAC Carbonate dehydratase II Carbonic anhydrase 2 (CA-II) Carbonic anhydrase C Carbonic anhydrase II (CA-II) Carbonic anhydrase II (hCA II) | Carbonic anhydrase isoenzyme II (hCA II)
Type:
Enzyme
Mol. Mass.:
29250.71
Organism:
Homo sapiens (Human)
Description:
P00918
Residue:
260
  
Inhibitor
Name:
BDBM50025625
Synonyms:
CHEMBL3337995
Type:
Small organic molecule
Emp. Form.:
C24H22N4O3S3
Mol. Mass.:
510.651
SMILES:
Cc1cccc2c1nc(SCC(=O)Nc1ccc(cc1)S(N)(=O)=O)n(Cc1ccccc1)c2=S
: