Target
Glycogen synthase kinase-3
Ligand
BDBM50025642
Substrate
Meas. Tech.
ChEMBL_1433002 (CHEMBL3384538)
IC50
<5.0±n/a nM
Citation
 Urich, RGrimaldi, RLuksch, TFrearson, JABrenk, RWyatt, PG The design and synthesis of potent and selective inhibitors of Trypanosoma brucei glycogen synthase kinase 3 for the treatment of human african trypanosomiasis. J Med Chem 57:7536-49 (2014)  
Target
Name:
Glycogen synthase kinase-3
Synonyms:
Glycogen synthase kinase-3 alpha/beta
Type:
Mol. Mass.:
Description:
ASSAY_ID of ChEMBL is 2193535
Components:
This complex has 2 components.
Component 1
Name:
Glycogen synthase kinase-3 alpha
Synonyms:
GSK-3 alpha GSK3A_HUMAN Glycogen synthase kinase-3 Glycogen synthase kinase-3 alpha (GSK3 Alpha) Glycogen synthase kinase-3 alpha (GSK3alpha)
Type:
Enzyme
Mol. Mass.:
50991.79
Organism:
Homo sapiens (Human)
Description:
P49840
Residue:
483
  
Component 2
Name:
Glycogen synthase kinase-3 beta
Synonyms:
GSK-3 beta GSK3B Glycogen synthase kinase 3 beta (GSK3B) Glycogen synthase kinase-3 beta (GSK-3B) Glycogen synthase kinase-3 beta (GSK3B) Glycogen synthase kinase-3beta (GSK3B) | Serine/threonine-protein kinase GSK3B
Type:
Enzyme
Mol. Mass.:
46756.38
Organism:
Homo sapiens (Human)
Description:
P49841
Residue:
420
  
Inhibitor
Name:
BDBM50025642
Synonyms:
CHEMBL3335143
Type:
Small organic molecule
Emp. Form.:
C18H20F2N4O3
Mol. Mass.:
378.3732
SMILES:
CO[C@H]1CC[C@@H](CC1)NC(=O)c1n[nH]cc1NC(=O)c1ccc(F)cc1F
: