Target
ALK tyrosine kinase receptor
Ligand
BDBM50436850
Substrate
Meas. Tech.
ChEMBL_1436034 (CHEMBL3383505)
IC50
3.4±n/a nM
Citation
 Liu, ZYue, XSong, ZPeng, XGuo, JJi, YCheng, ZDing, JAi, JGeng, MZhang, A Design, synthesis and pharmacological evaluation of 2-(thiazol-2-amino)-4-arylaminopyrimidines as potent anaplastic lymphoma kinase (ALK) inhibitors. Eur J Med Chem 86:438-48 (2014)  
Target
Name:
ALK tyrosine kinase receptor
Synonyms:
ALK ALK_HUMAN CD_antigen: CD246
Type:
Protein
Mol. Mass.:
176453.10
Organism:
Homo sapiens (Human)
Description:
Q9UM73
Residue:
1620
  
Inhibitor
Name:
BDBM50436850
Synonyms:
CERITINIB LDK378 US10618884, Example 16 | US9809572, Example 16
Type:
Small organic molecule
Emp. Form.:
C28H36ClN5O3S
Mol. Mass.:
558.135
SMILES:
CC(C)Oc1cc(C2CCNCC2)c(C)cc1Nc1ncc(Cl)c(Nc2ccccc2S(=O)(=O)C(C)C)n1
: