Target
Hexokinase-4
Ligand
BDBM50025825
Substrate
Meas. Tech.
ChEMBL_1436698 (CHEMBL3384774)
EC50
41400±n/a nM
Citation
 Hinklin, RJAicher, TDAnderson, DABaer, BRBoyd, SACondroski, KRDeWolf, WEKraser, CFMcVean, MRhodes, SPSturgis, HLVoegtli, WCWilliams, LHouze, JB Discovery of 2-pyridylureas as glucokinase activators. J Med Chem 57:8180-6 (2014)  
Target
Name:
Hexokinase-4
Synonyms:
GCK Glucokinase (GK) HK IV HXK4_HUMAN Hexokinase-D
Type:
Enzyme
Mol. Mass.:
52175.81
Organism:
Homo sapiens (Human)
Description:
P35557
Residue:
465
  
Inhibitor
Name:
BDBM50025825
Synonyms:
CHEMBL3338056
Type:
Small organic molecule
Emp. Form.:
C18H16N4O2S
Mol. Mass.:
352.41
SMILES:
CCc1ncccc1Oc1cc(Sc2ccccn2)cnc1NC=O
: