Target
Potassium voltage-gated channel subfamily H member 2
Ligand
BDBM50026240
Substrate
Meas. Tech.
ChEMBL_1438951 (CHEMBL3382462)
IC50
1400±n/a nM
Citation
 Wacker, DAWang, YBroekema, MRossi, KO'Connor, SHong, ZWu, GMalmstrom, SEHung, CPLaMarre, LChimalakonda, AZhang, LXin, LCai, HChu, CBoehm, SZalaznick, JPonticiello, RSereda, LHan, SPZebo, RZinker, BLuk, CEWong, REverlof, GLi, YXWu, CKLee, MGriffen, SMiller, KJKrupinski, JRobl, JA Discovery of 5-chloro-4-((1-(5-chloropyrimidin-2-yl)piperidin-4-yl)oxy)-1-(2-fluoro-4-(methylsulfonyl)phenyl)pyridin-2(1H)-one (BMS-903452), an antidiabetic clinical candidate targeting GPR119. J Med Chem 57:7499-508 (2014)  
Target
Name:
Potassium voltage-gated channel subfamily H member 2
Synonyms:
1,3-beta-glucan synthase component GLS2 ERG Eag-related protein 1 Ether-a-go-go-related gene (HERG) Ether-a-go-go-related gene potassium channel 1 Ether-a-go-go-related gene potassium channel 1 (hERG1) Ether-a-go-go-related protein 1 H-ERG KCNH2 Potassium voltage-gated channel subfamily H member 2 (hERG) Voltage-gated potassium channel subunit Kv11.1 hERG Potassium Channel 1 | putative potassium channel subunit
Type:
Multi-pass membrane protein
Mol. Mass.:
126672.65
Organism:
Homo sapiens (Human)
Description:
Q12809
Residue:
1159
  
Inhibitor
Name:
BDBM50026240
Synonyms:
CHEMBL3338194
Type:
Small organic molecule
Emp. Form.:
C21H19Cl2FN4O4S
Mol. Mass.:
513.369
SMILES:
CS(=O)(=O)c1ccc(c(F)c1)-n1cc(Cl)c(OC2CCN(CC2)c2ncc(Cl)cn2)cc1=O
: