Target
Retinol-binding protein 4
Ligand
BDBM50026244
Substrate
Meas. Tech.
ChEMBL_1441245 (CHEMBL3380010)
IC50
0.829000±n/a nM
Citation
 Cioffi, CLDobri, NFreeman, EEConlon, MPChen, PStafford, DGSchwarz, DMGolden, KCZhu, LKitchen, DBBarnes, KDRacz, BQin, QMichelotti, ECywin, CLMartin, WHPearson, PGJohnson, GPetrukhin, K Design, synthesis, and evaluation of nonretinoid retinol binding protein 4 antagonists for the potential treatment of atrophic age-related macular degeneration and Stargardt disease. J Med Chem 57:7731-57 (2014)  
Target
Name:
Retinol-binding protein 4
Synonyms:
PRBP RBP RET4_HUMAN Retinol-binding protein 4 (RBP4) | spa binding assay for rbp4
Type:
Protein
Mol. Mass.:
23008.75
Organism:
Homo sapiens (Human)
Description:
P02753
Residue:
201
  
Inhibitor
Name:
BDBM50026244
Synonyms:
CHEMBL3359028
Type:
Small organic molecule
Emp. Form.:
C23H23F3N2O3
Mol. Mass.:
432.4355
SMILES:
[H][C@@]12C[C@@H](C[C@]1([H])CN(C2)C(=O)N[C@H](C(O)=O)c1ccccc1)c1ccccc1C(F)(F)F
: