Target
Enoyl-[acyl-carrier-protein] reductase [NADH]
Ligand
BDBM50026427
Substrate
Meas. Tech.
ChEMBL_1433044 (CHEMBL3385192)
IC50
5120±n/a nM
Citation
 Pedgaonkar, GSSridevi, JPJeankumar, VUSaxena, SDevi, PBRenuka, JYogeeswari, PSriram, D Development of 2-(4-oxoquinazolin-3(4H)-yl)acetamide derivatives as novel enoyl-acyl carrier protein reductase (InhA) inhibitors for the treatment of tuberculosis. Eur J Med Chem 86:613-27 (2014)  
Target
Name:
Enoyl-[acyl-carrier-protein] reductase [NADH]
Synonyms:
Enoyl-ACP Reductase (InhA) Enoyl-[acyl-carrier-protein] reductase [NADH] NADH-dependent enoyl-ACP reductase | inhA
Type:
Enzyme
Mol. Mass.:
28526.00
Organism:
Mycobacterium tuberculosis (strain ATCC 25618 / H37Rv)
Description:
P9WGR1
Residue:
269
  
Inhibitor
Name:
BDBM50026427
Synonyms:
CHEMBL3331293
Type:
Small organic molecule
Emp. Form.:
C18H13N5O4S
Mol. Mass.:
395.392
SMILES:
[O-][N+](=O)c1ccc2nc(CNC(=O)Cn3cnc4ccccc4c3=O)sc2c1
: