Target
Dual specificity protein kinase CLK1
Ligand
BDBM50026605
Substrate
Meas. Tech.
ChEMBL_1435352 (CHEMBL3382860)
IC50
300±n/a nM
Citation
 Schmitt, CMiralinaghi, PMariano, MHartmann, RWEngel, M Hydroxybenzothiophene Ketones Are Efficient Pre-mRNA Splicing Modulators Due to Dual Inhibition of Dyrk1A and Clk1/4. ACS Med Chem Lett 5:963-7 (2014)  
Target
Name:
Dual specificity protein kinase CLK1
Synonyms:
CDC-like kinase 1 CDC2-like kinase 1 (CLK1) CLK1 Dual specificity protein kinase CLK1 Dual specificty protein kinase CLK1
Type:
Protein
Mol. Mass.:
57322.21
Organism:
Homo sapiens (Human)
Description:
P49759
Residue:
484
  
Inhibitor
Name:
BDBM50026605
Synonyms:
CHEMBL3335354
Type:
Small organic molecule
Emp. Form.:
C15H10O3S
Mol. Mass.:
270.303
SMILES:
Oc1ccc(cc1)C(=O)c1cc2cc(O)ccc2s1
: