Target
D(3) dopamine receptor
Ligand
BDBM50026745
Substrate
Meas. Tech.
ChEMBL_1437449 (CHEMBL3387259)
Ki
0.750000±n/a nM
Citation
 Vass, MAgai-Csongor, EHorti, FKeseru, GM Multiple fragment docking and linking in primary and secondary pockets of dopamine receptors. ACS Med Chem Lett 5:1010-4 (2014)  
Target
Name:
D(3) dopamine receptor
Synonyms:
DOPAMINE D3 DRD3_HUMAN Dopamine D3 receptor (D3) Dopamine receptor Dopamine receptor D3
Type:
Mol. Mass.:
44243.43
Organism:
Homo sapiens (Human)
Description:
Residue:
400
  
Inhibitor
Name:
BDBM50026745
Synonyms:
CHEMBL3335470
Type:
Small organic molecule
Emp. Form.:
C21H28F3N5O
Mol. Mass.:
423.4751
SMILES:
NC(=O)N[C@H]1CC[C@H](CCN2CCN(CC2)c2cc(cc(c2)C(F)(F)F)C#N)CC1
: