Target
Thromboxane A2 receptor
Ligand
BDBM50026750
Substrate
Meas. Tech.
ChEMBL_1437451 (CHEMBL3387261)
IC50
0.015000±n/a nM
Citation
 Wang, XLiu, LHuang, LHerbst-Robinson, KCornec, ASJames, MJSugiyama, SBassetto, MBrancale, ATrojanowski, JQLee, VMSmith, ABBrunden, KRBallatore, C Potent, long-acting cyclopentane-1,3-Dione thromboxane (A2)-receptor antagonists. ACS Med Chem Lett 5:1015-20 (2014)  
Target
Name:
Thromboxane A2 receptor
Synonyms:
Prostanoid TP receptor TBXA2R Thromboxane Thromboxane Beta
Type:
Enyzme
Mol. Mass.:
37445.28
Organism:
Homo sapiens (Human)
Description:
P21731
Residue:
343
  
Inhibitor
Name:
BDBM50026750
Synonyms:
CHEMBL3354618
Type:
Small organic molecule
Emp. Form.:
C30H30ClNO4S
Mol. Mass.:
536.082
SMILES:
Cc1cccc(C)c1C1=C(O)CC(Cc2cccc3CC(CCc23)NS(=O)(=O)c2ccc(Cl)cc2)C1=O
: