Target
Thromboxane A2 receptor
Ligand
BDBM50026760
Substrate
Meas. Tech.
ChEMBL_1437451 (CHEMBL3387261)
IC50
3.9±n/a nM
Citation
 Wang, XLiu, LHuang, LHerbst-Robinson, KCornec, ASJames, MJSugiyama, SBassetto, MBrancale, ATrojanowski, JQLee, VMSmith, ABBrunden, KRBallatore, C Potent, long-acting cyclopentane-1,3-Dione thromboxane (A2)-receptor antagonists. ACS Med Chem Lett 5:1015-20 (2014)  
Target
Name:
Thromboxane A2 receptor
Synonyms:
Prostanoid TP receptor TBXA2R Thromboxane Thromboxane Beta
Type:
Enyzme
Mol. Mass.:
37445.28
Organism:
Homo sapiens (Human)
Description:
P21731
Residue:
343
  
Inhibitor
Name:
BDBM50026760
Synonyms:
CHEMBL3354614
Type:
Small organic molecule
Emp. Form.:
C28H26ClNO4S
Mol. Mass.:
508.028
SMILES:
OC1=C(C(=O)C(Cc2cccc3CC(CCc23)NS(=O)(=O)c2ccc(Cl)cc2)C1)c1ccccc1
: