Target
Thromboxane A2 receptor
Ligand
BDBM50026761
Substrate
Meas. Tech.
ChEMBL_1437451 (CHEMBL3387261)
IC50
6.5±n/a nM
Citation
 Wang, XLiu, LHuang, LHerbst-Robinson, KCornec, ASJames, MJSugiyama, SBassetto, MBrancale, ATrojanowski, JQLee, VMSmith, ABBrunden, KRBallatore, C Potent, long-acting cyclopentane-1,3-Dione thromboxane (A2)-receptor antagonists. ACS Med Chem Lett 5:1015-20 (2014)  
Target
Name:
Thromboxane A2 receptor
Synonyms:
Prostanoid TP receptor TBXA2R Thromboxane Thromboxane Beta
Type:
Enyzme
Mol. Mass.:
37445.28
Organism:
Homo sapiens (Human)
Description:
P21731
Residue:
343
  
Inhibitor
Name:
BDBM50026761
Synonyms:
CHEMBL3354615
Type:
Small organic molecule
Emp. Form.:
C28H25ClFNO4S
Mol. Mass.:
526.019
SMILES:
OC1=C(C(=O)C(Cc2cccc3CC(CCc23)NS(=O)(=O)c2ccc(Cl)cc2)C1)c1ccc(F)cc1
: