Target
Genome polyprotein
Ligand
BDBM50026765
Substrate
Meas. Tech.
ChEMBL_1438217 (CHEMBL3390249)
Ki
49000±n/a nM
Citation
 Behnam, MANitsche, CVechi, SMKlein, CD C-terminal residue optimization and fragment merging: discovery of a potent Peptide-hybrid inhibitor of dengue protease. ACS Med Chem Lett 5:1037-42 (2014)  
Target
Name:
Genome polyprotein
Synonyms:
POLG_WNV | polyprotein precursor
Type:
PROTEIN
Mol. Mass.:
380170.63
Organism:
West Nile virus
Description:
ChEMBL_1438217
Residue:
3430
  
Inhibitor
Name:
BDBM50026765
Synonyms:
CHEMBL3335494
Type:
Small organic molecule
Emp. Form.:
C27H38N8O4
Mol. Mass.:
538.6418
SMILES:
NCCCC[C@H](NC(=O)[C@H](CCCNC(N)=N)NC(=O)c1ccccc1)C(=O)N[C@H](C(N)=O)c1ccccc1
: