Target
Histone deacetylase 8
Ligand
BDBM50027649
Substrate
Meas. Tech.
ChEMBL_1443004 (CHEMBL3379482)
IC50
62±n/a nM
Citation
 Giannini, GVesci, LBattistuzzi, GVignola, DMilazzo, FMGuglielmi, MBBarbarino, MSantaniello, MFantò, NMor, MRivara, SPala, DTaddei, MPisano, CCabri, W ST7612AA1, a thioacetate-¿(¿-lactam carboxamide) derivative selected from a novel generation of oral HDAC inhibitors. J Med Chem 57:8358-77 (2014)  
Target
Name:
Histone deacetylase 8
Synonyms:
HD8 HDAC8_HUMAN Histone deacetylase 8 (HDAC-8) | Human HDAC8
Type:
Enzyme
Mol. Mass.:
41749.60
Organism:
Homo sapiens (Human)
Description:
Q9BY41
Residue:
377
  
Inhibitor
Name:
BDBM50027649
Synonyms:
CHEMBL3356527
Type:
Small organic molecule
Emp. Form.:
C19H27N3O3S
Mol. Mass.:
377.501
SMILES:
SCCCCC[C@H](NC(=O)[C@@H]1CCCNC1=O)C(=O)Nc1ccccc1
: