Target
Histone deacetylase 1
Ligand
BDBM152692
Substrate
Meas. Tech.
ChEMBL_1443000 (CHEMBL3379478)
IC50
288±n/a nM
Citation
 Giannini, GVesci, LBattistuzzi, GVignola, DMilazzo, FMGuglielmi, MBBarbarino, MSantaniello, MFantò, NMor, MRivara, SPala, DTaddei, MPisano, CCabri, W ST7612AA1, a thioacetate-¿(¿-lactam carboxamide) derivative selected from a novel generation of oral HDAC inhibitors. J Med Chem 57:8358-77 (2014)  
Target
Name:
Histone deacetylase 1
Synonyms:
Cereblon/Histone deacetylase 1 HDAC1 Histone deacetylase 1 (HDAC1) RPD3L1
Type:
Enzyme
Mol. Mass.:
55090.27
Organism:
Homo sapiens (Human)
Description:
Q13547
Residue:
482
  
Inhibitor
Name:
BDBM152692
Synonyms:
Thiol-SAHA (t-SAHA)
Type:
Small organic molecule
Emp. Form.:
C13H19NOS
Mol. Mass.:
237.361
SMILES:
SCCCCCCC(=O)Nc1ccccc1
: