Target
Polyamine deacetylase HDAC10
Ligand
BDBM50027501
Substrate
Meas. Tech.
ChEMBL_1443005 (CHEMBL3379483)
IC50
4.0±n/a nM
Citation
 Giannini, GVesci, LBattistuzzi, GVignola, DMilazzo, FMGuglielmi, MBBarbarino, MSantaniello, MFantò, NMor, MRivara, SPala, DTaddei, MPisano, CCabri, W ST7612AA1, a thioacetate-¿(¿-lactam carboxamide) derivative selected from a novel generation of oral HDAC inhibitors. J Med Chem 57:8358-77 (2014)  
Target
Name:
Polyamine deacetylase HDAC10
Synonyms:
HD10 HDAC10 Histone deacetylase 10 | Human HDAC10
Type:
Chromatin regulator; hydrolase; repressor
Mol. Mass.:
71431.89
Organism:
Homo sapiens (Human)
Description:
Q969S8
Residue:
669
  
Inhibitor
Name:
BDBM50027501
Synonyms:
CHEMBL3356923
Type:
Small organic molecule
Emp. Form.:
C19H27N3O3S
Mol. Mass.:
377.501
SMILES:
Cc1cccc(NC(=O)[C@H](CCCCCS)NC(=O)[C@H]2CCC(=O)N2)c1
: