Target
Histone deacetylase 6
Ligand
BDBM120958
Substrate
Meas. Tech.
ChEMBL_1433094 (CHEMBL3386351)
EC50
930±n/a nM
Citation
 Tang, GWong, JCZhang, WWang, ZZhang, NPeng, ZZhang, ZRong, YLi, SZhang, MYu, LFeng, TZhang, XWu, XWu, JZChen, L Identification of a novel aminotetralin class of HDAC6 and HDAC8 selective inhibitors. J Med Chem 57:8026-34 (2014)  
Target
Name:
Histone deacetylase 6
Synonyms:
Cereblon/Histone deacetylase 6 HDAC6 Histone deacetylase 6 (HDAC6) KIAA0901 | ORF Names:JM21
Type:
Chromatin regulator; hydrolase; repressor
Mol. Mass.:
131381.51
Organism:
Homo sapiens (Human)
Description:
Q9UBN7
Residue:
1215
  
Inhibitor
Name:
BDBM120958
Synonyms:
US8716285, 15
Type:
Small organic molecule
Emp. Form.:
C21H19ClN4O2
Mol. Mass.:
394.854
SMILES:
ONC(=O)c1ccc2CCC(Cc2c1)Nc1nccc(n1)-c1ccccc1Cl
: