Target
DNA gyrase subunit A/B
Ligand
BDBM50027666
Substrate
Meas. Tech.
ChEMBL_1433936 (CHEMBL3389994)
IC50
>1000000±n/a nM
Citation
 Feng, LMaddox, MMAlam, MZTsutsumi, LSNarula, GBruhn, DFWu, XSandhaus, SLee, RBSimmons, CJTse-Dinh, YCHurdle, JGLee, RESun, D Synthesis, structure-activity relationship studies, and antibacterial evaluation of 4-chromanones and chalcones, as well as olympicin A and derivatives. J Med Chem 57:8398-420 (2014)  
Target
Name:
DNA gyrase subunit A/B
Synonyms:
DNA Gyrase | DNA gyrase A/B
Type:
A2B2 tetramer
Mol. Mass.:
Description:
Components:
This complex has 2 components.
Component 1
Name:
DNA gyrase subunit A
Synonyms:
DNA gyrase GYRA_ECOLI hisW parD
Type:
Enzyme Subunit
Mol. Mass.:
96935.15
Organism:
Escherichia coli (strain K12)
Description:
Residue:
875
  
Component 2
Name:
DNA gyrase subunit B
Synonyms:
DNA gyrase subunit B GYRB_ECOLI acrB gyrB hisU parA | pcbA
Type:
Enzyme Subunit
Mol. Mass.:
89941.28
Organism:
Escherichia coli (strain K12)
Description:
P0AES6
Residue:
804
  
Inhibitor
Name:
BDBM50027666
Synonyms:
CHEMBL3357535
Type:
Small organic molecule
Emp. Form.:
C21H24O4
Mol. Mass.:
340.4129
SMILES:
CCCCCCOc1ccccc1\C=C\C(=O)c1ccc(O)cc1O
: