Target
DNA gyrase subunit A/B
Ligand
BDBM21691
Substrate
Meas. Tech.
ChEMBL_1433936 (CHEMBL3389994)
IC50
100000±n/a nM
Citation
 Feng, LMaddox, MMAlam, MZTsutsumi, LSNarula, GBruhn, DFWu, XSandhaus, SLee, RBSimmons, CJTse-Dinh, YCHurdle, JGLee, RESun, D Synthesis, structure-activity relationship studies, and antibacterial evaluation of 4-chromanones and chalcones, as well as olympicin A and derivatives. J Med Chem 57:8398-420 (2014)  
Target
Name:
DNA gyrase subunit A/B
Synonyms:
DNA Gyrase | DNA gyrase A/B
Type:
A2B2 tetramer
Mol. Mass.:
Description:
Components:
This complex has 2 components.
Component 1
Name:
DNA gyrase subunit A
Synonyms:
DNA gyrase GYRA_ECOLI hisW parD
Type:
Enzyme Subunit
Mol. Mass.:
96935.15
Organism:
Escherichia coli (strain K12)
Description:
Residue:
875
  
Component 2
Name:
DNA gyrase subunit B
Synonyms:
DNA gyrase subunit B GYRB_ECOLI acrB gyrB hisU parA | pcbA
Type:
Enzyme Subunit
Mol. Mass.:
89941.28
Organism:
Escherichia coli (strain K12)
Description:
P0AES6
Residue:
804
  
Inhibitor
Name:
BDBM21691
Synonyms:
1-ethyl-7-methyl-4-oxo-1,4-dihydro-1,8-naphthyridine-3-carboxylic acid Nalidixin Nevigramon US9144538, Nalidixic acid
Type:
Small organic molecule
Emp. Form.:
C12H12N2O3
Mol. Mass.:
232.2353
SMILES:
CCn1cc(C(O)=O)c(=O)c2ccc(C)nc12
: