Target
Cytochrome b-c1 complex subunit 7
Ligand
BDBM60397
Substrate
Meas. Tech.
ChEMBL_1436866 (CHEMBL3387788)
IC50
>20000±n/a nM
Citation
 Jung, HJCho, MKim, YHan, GKwon, HJ Development of a novel class of mitochondrial ubiquinol-cytochrome c reductase binding protein (UQCRB) modulators as promising antiangiogenic leads. J Med Chem 57:7990-8 (2014)  
Target
Name:
Cytochrome b-c1 complex subunit 7
Synonyms:
Complex III subunit 7 Cytochrome b-c1 complex subunit 7 QP-C UQCRB | Ubiquinol-cytochrome c reductase complex 14 kDa protein
Type:
PROTEIN
Mol. Mass.:
13532.80
Organism:
Homo sapiens (Human)
Description:
ChEMBL_103899
Residue:
111
  
Inhibitor
Name:
BDBM60397
Synonyms:
MLS000115777 N-(4-hydroxyphenyl)quinoline-8-sulfonamide cid_894115
Type:
Small organic molecule
Emp. Form.:
C15H12N2O3S
Mol. Mass.:
300.332
SMILES:
Oc1ccc(NS(=O)(=O)c2cccc3cccnc23)cc1
: