Target
Bromodomain-containing protein 2
Ligand
BDBM50028117
Substrate
Meas. Tech.
ChEMBL_1434712 (CHEMBL3382827)
IC50
794±n/a nM
Citation
 Gosmini, RNguyen, VLToum, JSimon, CBrusq, JMKrysa, GMirguet, ORiou-Eymard, AMBoursier, EVTrottet, LBamborough, PClark, HChung, CWCutler, LDemont, EHKaur, RLewis, AJSchilling, MBSoden, PETaylor, SWalker, ALWalker, MDPrinjha, RKNicodème, E The discovery of I-BET726 (GSK1324726A), a potent tetrahydroquinoline ApoA1 up-regulator and selective BET bromodomain inhibitor. J Med Chem 57:8111-31 (2014)  
Target
Name:
Bromodomain-containing protein 2
Synonyms:
BRD2 Bromodomain and extra-terminal motif (BET) Bromodomain-containing protein 2 (BRD2) RING3
Type:
Protein
Mol. Mass.:
88085.95
Organism:
Homo sapiens (Human)
Description:
P25440
Residue:
801
  
Inhibitor
Name:
BDBM50028117
Synonyms:
CHEMBL3353989
Type:
Small organic molecule
Emp. Form.:
C25H26N2O2
Mol. Mass.:
386.4861
SMILES:
C[C@H]1C[C@@H](Nc2ccccc2)c2cc(ccc2N1C(C)=O)-c1ccc(CO)cc1
: