Target
Cytochrome P450 2C19
Ligand
BDBM50028128
Substrate
Meas. Tech.
ChEMBL_1434725 (CHEMBL3382840)
IC50
20000±n/a nM
Citation
 Gosmini, RNguyen, VLToum, JSimon, CBrusq, JMKrysa, GMirguet, ORiou-Eymard, AMBoursier, EVTrottet, LBamborough, PClark, HChung, CWCutler, LDemont, EHKaur, RLewis, AJSchilling, MBSoden, PETaylor, SWalker, ALWalker, MDPrinjha, RKNicodème, E The discovery of I-BET726 (GSK1324726A), a potent tetrahydroquinoline ApoA1 up-regulator and selective BET bromodomain inhibitor. J Med Chem 57:8111-31 (2014)  
Target
Name:
Cytochrome P450 2C19
Synonyms:
CP2CJ_HUMAN CYPIIC17 Cytochrome P450 2C19 (CYP2C19) Mephenytoin 4-hydroxylase P450-254C
Type:
Enzyme
Mol. Mass.:
55935.47
Organism:
Homo sapiens (Human)
Description:
P33261
Residue:
490
  
Inhibitor
Name:
BDBM50028128
Synonyms:
CHEMBL3353992
Type:
Small organic molecule
Emp. Form.:
C30H35N3O
Mol. Mass.:
453.6184
SMILES:
C[C@H]1C[C@@H](Nc2ccccc2)c2cc(ccc2N1C(C)=O)-c1ccc(CN2CCCCC2)cc1
: