Target
Protein kinase C theta type
Ligand
BDBM50028413
Substrate
Meas. Tech.
ChEMBL_1436875 (CHEMBL3387797)
IC50
8.0±n/a nM
Citation
 George, DMBreinlinger, ECArgiriadi, MAZhang, YWang, JBansal-Pakala, PDuignan, DBHonore, PLang, QMittelstadt, SRundell, LSchwartz, ASun, JEdmunds, JJ Optimized protein kinase C¿ (PKC¿) inhibitors reveal only modest anti-inflammatory efficacy in a rodent model of arthritis. J Med Chem 58:333-46 (2015)  
Target
Name:
Protein kinase C theta type
Synonyms:
KPCT_HUMAN PRKCT Protein kinase C theta type (PRKCQ) nPKC-theta
Type:
Serine/threonine-protein kinase
Mol. Mass.:
81878.04
Organism:
Homo sapiens (Human)
Description:
Full-length human PKC theta (Panvera Catalog No. P2996).
Residue:
706
  
Inhibitor
Name:
BDBM50028413
Synonyms:
CHEMBL3355130
Type:
Small organic molecule
Emp. Form.:
C25H30N4O2
Mol. Mass.:
418.5313
SMILES:
C[C@H]1CN(C)CC[C@H]1c1cc2N3[C@H](C)C(=O)NN=C3COc2cc1-c1ccccc1C
: