Target
Bile acid receptor
Ligand
BDBM50028459
Substrate
Meas. Tech.
ChEMBL_1437553 (CHEMBL3389080)
EC50
2900±n/a nM
Citation
 Merk, DLamers, CAhmad, KCarrasco Gomez, RSchneider, GSteinhilber, DSchubert-Zsilavecz, M Extending the structure-activity relationship of anthranilic acid derivatives as farnesoid X receptor modulators: development of a highly potent partial farnesoid X receptor agonist. J Med Chem 57:8035-55 (2014)  
Target
Name:
Bile acid receptor
Synonyms:
BAR FXR HRR1 NR1H4_HUMAN RIP14 Retinoid X receptor-interacting protein 14 | farnesoid x receptor
Type:
Nuclear Receptor
Mol. Mass.:
55916.24
Organism:
Homo sapiens (Human)
Description:
Q96RI1
Residue:
486
  
Inhibitor
Name:
BDBM50028459
Synonyms:
CHEMBL3335649
Type:
Small organic molecule
Emp. Form.:
C25H24N6O2
Mol. Mass.:
440.4971
SMILES:
CC(C)(C)c1ccc(cc1)C(=O)Nc1ccccc1C(=O)Nc1cccc(c1)-c1nnn[nH]1
: