Target
Bile acid receptor
Ligand
BDBM50028475
Substrate
Meas. Tech.
ChEMBL_1437553 (CHEMBL3389080)
EC50
110±n/a nM
Citation
 Merk, DLamers, CAhmad, KCarrasco Gomez, RSchneider, GSteinhilber, DSchubert-Zsilavecz, M Extending the structure-activity relationship of anthranilic acid derivatives as farnesoid X receptor modulators: development of a highly potent partial farnesoid X receptor agonist. J Med Chem 57:8035-55 (2014)  
Target
Name:
Bile acid receptor
Synonyms:
BAR FXR HRR1 NR1H4_HUMAN RIP14 Retinoid X receptor-interacting protein 14 | farnesoid x receptor
Type:
Nuclear Receptor
Mol. Mass.:
55916.24
Organism:
Homo sapiens (Human)
Description:
Q96RI1
Residue:
486
  
Inhibitor
Name:
BDBM50028475
Synonyms:
CHEMBL3335673
Type:
Small organic molecule
Emp. Form.:
C26H25ClN2O4
Mol. Mass.:
464.941
SMILES:
Cc1ccc(NC(=O)c2ccc(Cl)cc2NC(=O)c2ccc(cc2)C(C)(C)C)cc1C(O)=O
: