Target
Bile acid receptor
Ligand
BDBM50028477
Substrate
Meas. Tech.
ChEMBL_1437553 (CHEMBL3389080)
EC50
43±n/a nM
Citation
 Merk, DLamers, CAhmad, KCarrasco Gomez, RSchneider, GSteinhilber, DSchubert-Zsilavecz, M Extending the structure-activity relationship of anthranilic acid derivatives as farnesoid X receptor modulators: development of a highly potent partial farnesoid X receptor agonist. J Med Chem 57:8035-55 (2014)  
Target
Name:
Bile acid receptor
Synonyms:
BAR FXR HRR1 NR1H4_HUMAN RIP14 Retinoid X receptor-interacting protein 14 | farnesoid x receptor
Type:
Nuclear Receptor
Mol. Mass.:
55916.24
Organism:
Homo sapiens (Human)
Description:
Q96RI1
Residue:
486
  
Inhibitor
Name:
BDBM50028477
Synonyms:
CHEMBL3335675
Type:
Small organic molecule
Emp. Form.:
C27H28N2O4
Mol. Mass.:
444.5222
SMILES:
Cc1ccc(C(=O)Nc2ccc(C)c(c2)C(O)=O)c(NC(=O)c2ccc(cc2)C(C)(C)C)c1
: