Target
Neuraminidase
Ligand
BDBM50028522
Substrate
Meas. Tech.
ChEMBL_1437610 (CHEMBL3390212)
IC50
38±n/a nM
Citation
 Xie, YXu, DHuang, BMa, XQi, WShi, FLiu, XZhang, YXu, W Discovery of N-substituted oseltamivir derivatives as potent and selective inhibitors of H5N1 influenza neuraminidase. J Med Chem 57:8445-58 (2014)  
Target
Name:
Neuraminidase
Synonyms:
NA Neuraminidase
Type:
PROTEIN
Mol. Mass.:
51863.92
Organism:
Influenza A virus (strain A/USSR/90/1977 H1N1)
Description:
ChEMBL_109720
Residue:
470
  
Inhibitor
Name:
BDBM50028522
Synonyms:
CHEMBL3342484
Type:
Small organic molecule
Emp. Form.:
C33H38N2O4
Mol. Mass.:
526.6658
SMILES:
CCC(CC)O[C@@H]1C=C(C[C@H](NCc2ccc(cc2-c2ccccc2)-c2ccccc2)[C@H]1NC(C)=O)C(O)=O
: