Target
Cholinesterase
Ligand
BDBM50028596
Substrate
Meas. Tech.
ChEMBL_1438381 (CHEMBL3383056)
IC50
37400±n/a nM
Citation
 Khan, IIbrar, AZaib, SAhmad, SFurtmann, NHameed, SSimpson, JBajorath, JIqbal, J Active compounds from a diverse library of triazolothiadiazole and triazolothiadiazine scaffolds: synthesis, crystal structure determination, cytotoxicity, cholinesterase inhibitory activity, and binding mode analysis. Bioorg Med Chem 22:6163-73 (2014)  
Target
Name:
Cholinesterase
Synonyms:
Acylcholine acylhydrolase Butyrylcholine esterase (BChE) Butyrylcholinesterase (BuChE) CHLE_HUMAN Cholinesterases Pseudocholinesterase
Type:
Homotetramer
Mol. Mass.:
68422.27
Organism:
Homo sapiens (Human)
Description:
P06276
Residue:
602
  
Inhibitor
Name:
BDBM50028596
Synonyms:
CHEMBL3338944
Type:
Small organic molecule
Emp. Form.:
C14H7ClFN5S
Mol. Mass.:
331.755
SMILES:
Fc1cc(Cl)ccc1-c1nn2c(nnc2s1)-c1cccnc1
: