Target
Acetylcholinesterase
Ligand
BDBM50028607
Substrate
Meas. Tech.
ChEMBL_1438379 (CHEMBL3383054)
IC50
39700±n/a nM
Citation
 Khan, IIbrar, AZaib, SAhmad, SFurtmann, NHameed, SSimpson, JBajorath, JIqbal, J Active compounds from a diverse library of triazolothiadiazole and triazolothiadiazine scaffolds: synthesis, crystal structure determination, cytotoxicity, cholinesterase inhibitory activity, and binding mode analysis. Bioorg Med Chem 22:6163-73 (2014)  
Target
Name:
Acetylcholinesterase
Synonyms:
ACES_ELEEL Acetylcholinesterase (EeAChE) | ache
Type:
Enzyme
Mol. Mass.:
71812.79
Organism:
Electrophorus electricus (Electric eel)
Description:
Residue:
633
  
Inhibitor
Name:
BDBM50028607
Synonyms:
CHEMBL3338960
Type:
Small organic molecule
Emp. Form.:
C21H15N5S
Mol. Mass.:
369.442
SMILES:
C1Sc2nnc(-c3cccnc3)n2N=C1c1ccc(cc1)-c1ccccc1
: