Target
Acetylcholinesterase
Ligand
BDBM50028679
Substrate
Meas. Tech.
ChEMBL_1439857 (CHEMBL3387411)
IC50
14±n/a nM
Citation
 Nepovimova, EUliassi, EKorabecny, JPeña-Altamira, LESamez, SPesaresi, AGarcia, GEBartolini, MAndrisano, VBergamini, CFato, RLamba, DRoberti, MKuca, KMonti, BBolognesi, ML Multitarget drug design strategy: quinone-tacrine hybrids designed to block amyloid-ß aggregation and to exert anticholinesterase and antioxidant effects. J Med Chem 57:8576-89 (2014)  
Target
Name:
Acetylcholinesterase
Synonyms:
ACES_HUMAN Acetylcholinesterase (AChE) | Acetylcholinesterase (human AChE)
Type:
Enzyme
Mol. Mass.:
67792.70
Organism:
Homo sapiens (Human)
Description:
P22303
Residue:
614
  
Inhibitor
Name:
BDBM50028679
Synonyms:
CHEMBL3356530
Type:
Small organic molecule
Emp. Form.:
C25H23N3O2
Mol. Mass.:
397.469
SMILES:
O=C1C=C(NCCNc2c3CCCCc3nc3ccccc23)C(=O)c2ccccc12
: