Target
C3a anaphylatoxin chemotactic receptor
Ligand
BDBM50028778
Substrate
Meas. Tech.
ChEMBL_1439872 (CHEMBL3387987)
IC50
79±n/a nM
Citation
 Reid, RCYau, MKSingh, RHamidon, JKLim, JStoermer, MJFairlie, DP Potent heterocyclic ligands for human complement c3a receptor. J Med Chem 57:8459-70 (2014)  
Target
Name:
C3a anaphylatoxin chemotactic receptor
Synonyms:
AZ3B C3AR1 C3R1 HNFAG09
Type:
PROTEIN
Mol. Mass.:
53864.66
Organism:
Homo sapiens (Human)
Description:
ChEMBL_642034
Residue:
482
  
Inhibitor
Name:
BDBM50028778
Synonyms:
CHEMBL3342687
Type:
Small organic molecule
Emp. Form.:
C29H30N6O3
Mol. Mass.:
510.5869
SMILES:
NC(=N)NCCC[C@H](NC(=O)c1nc([nH]c1-c1ccccc1)C(c1ccccc1)c1ccccc1)C(O)=O
: