Target
C3a anaphylatoxin chemotactic receptor
Ligand
BDBM50028775
Substrate
Meas. Tech.
ChEMBL_1439872 (CHEMBL3387987)
IC50
54±n/a nM
Citation
 Reid, RCYau, MKSingh, RHamidon, JKLim, JStoermer, MJFairlie, DP Potent heterocyclic ligands for human complement c3a receptor. J Med Chem 57:8459-70 (2014)  
Target
Name:
C3a anaphylatoxin chemotactic receptor
Synonyms:
AZ3B C3AR1 C3R1 HNFAG09
Type:
PROTEIN
Mol. Mass.:
53864.66
Organism:
Homo sapiens (Human)
Description:
ChEMBL_642034
Residue:
482
  
Inhibitor
Name:
BDBM50028775
Synonyms:
CHEMBL3342681
Type:
Small organic molecule
Emp. Form.:
C22H24N6O4
Mol. Mass.:
436.4638
SMILES:
NC(=N)NCCC[C@H](NC(=O)c1noc(n1)C(c1ccccc1)c1ccccc1)C(O)=O
: