Target
Neuropeptide FF receptor 2
Ligand
BDBM50029096
Substrate
Meas. Tech.
ChEMBL_1436239 (CHEMBL3387186)
Ki
1426±n/a nM
Citation
 Journigan, VBMésangeau, CVyas, NEans, SOCutler, SJMcLaughlin, JPMollereau, CMcCurdy, CR Nonpeptide small molecule agonist and antagonist original leads for neuropeptide FF1 and FF2 receptors. J Med Chem 57:8903-27 (2014)  
Target
Name:
Neuropeptide FF receptor 2
Synonyms:
G-protein coupled receptor 74 GPR74 NPFF2_HUMAN NPGPR Neuropeptide G-protein coupled receptor
Type:
Enzyme Catalytic Domain
Mol. Mass.:
60293.78
Organism:
Homo sapiens (Human)
Description:
NPFF2 0 HUMAN::Q9Y5X5
Residue:
522
  
Inhibitor
Name:
BDBM50029096
Synonyms:
CHEMBL3361425
Type:
Small organic molecule
Emp. Form.:
C22H30N6O
Mol. Mass.:
394.5132
SMILES:
NC(=N)NCCNC(=O)C1(CCN(Cc2ccccc2)CC1)Nc1ccccc1
: