Target
Neuropeptide FF receptor 2
Ligand
BDBM50029131
Substrate
Meas. Tech.
ChEMBL_1436239 (CHEMBL3387186)
Ki
1513±n/a nM
Citation
 Journigan, VBMésangeau, CVyas, NEans, SOCutler, SJMcLaughlin, JPMollereau, CMcCurdy, CR Nonpeptide small molecule agonist and antagonist original leads for neuropeptide FF1 and FF2 receptors. J Med Chem 57:8903-27 (2014)  
Target
Name:
Neuropeptide FF receptor 2
Synonyms:
G-protein coupled receptor 74 GPR74 NPFF2_HUMAN NPGPR Neuropeptide G-protein coupled receptor
Type:
Enzyme Catalytic Domain
Mol. Mass.:
60293.78
Organism:
Homo sapiens (Human)
Description:
NPFF2 0 HUMAN::Q9Y5X5
Residue:
522
  
Inhibitor
Name:
BDBM50029131
Synonyms:
CHEMBL3361432
Type:
Small organic molecule
Emp. Form.:
C24H32N6O3
Mol. Mass.:
452.5493
SMILES:
COC(=O)c1ccc(CN2CCC(CNC(=O)CNC(N)=N)(CC2)Nc2ccccc2)cc1
: