Target
Neuropeptide FF receptor 1
Ligand
BDBM50029138
Substrate
Meas. Tech.
ChEMBL_1436237 (CHEMBL3387184)
Ki
4.0±n/a nM
Citation
 Journigan, VBMésangeau, CVyas, NEans, SOCutler, SJMcLaughlin, JPMollereau, CMcCurdy, CR Nonpeptide small molecule agonist and antagonist original leads for neuropeptide FF1 and FF2 receptors. J Med Chem 57:8903-27 (2014)  
Target
Name:
Neuropeptide FF receptor 1
Synonyms:
G-protein coupled receptor 147 NPFF1 NPFFR1 | RFamide-related peptide receptor OT7T022
Type:
PROTEIN
Mol. Mass.:
47840.07
Organism:
Homo sapiens (Human)
Description:
ChEMBL_1474637
Residue:
430
  
Inhibitor
Name:
BDBM50029138
Synonyms:
CHEMBL3360830
Type:
Small organic molecule
Emp. Form.:
C55H78N14O11
Mol. Mass.:
1111.295
SMILES:
CC(C)C[C@@H](N(C)C(=O)[C@H](N)Cc1ccc(O)cc1)C(=O)N[C@@H](Cc1ccccc1)C(=O)N[C@@H](CCC(N)=O)C(=O)N1CCC[C@H]1C(=O)N[C@@H](CCC(N)=O)C(=O)N[C@@H](CCCNC(N)=N)C(=O)N[C@@H](Cc1ccccc1)C(N)=O
: