Target
Neuropeptide FF receptor 1
Ligand
BDBM50029122
Substrate
Meas. Tech.
ChEMBL_1436238 (CHEMBL3387185)
Ki
151±n/a nM
Citation
 Journigan, VBMésangeau, CVyas, NEans, SOCutler, SJMcLaughlin, JPMollereau, CMcCurdy, CR Nonpeptide small molecule agonist and antagonist original leads for neuropeptide FF1 and FF2 receptors. J Med Chem 57:8903-27 (2014)  
Target
Name:
Neuropeptide FF receptor 1
Synonyms:
G-protein coupled receptor 147 NPFF1 NPFFR1 | RFamide-related peptide receptor OT7T022
Type:
PROTEIN
Mol. Mass.:
47840.07
Organism:
Homo sapiens (Human)
Description:
ChEMBL_1474637
Residue:
430
  
Inhibitor
Name:
BDBM50029122
Synonyms:
CHEMBL3361424
Type:
Small organic molecule
Emp. Form.:
C24H33N5O
Mol. Mass.:
407.5517
SMILES:
NC(=N)NCC(=O)NCC1(CCc2ccccc2)CCN(Cc2ccccc2)CC1
: