Target
Isocitrate dehydrogenase [NADP] cytoplasmic
Ligand
BDBM50029479
Substrate
Meas. Tech.
ChEMBL_1436945 (CHEMBL3388443)
Ki
950±n/a nM
Citation
 Liu, ZYao, YKogiso, MZheng, BDeng, LQiu, JJDong, SLv, HGallo, JMLi, XNSong, Y Inhibition of cancer-associated mutant isocitrate dehydrogenases: synthesis, structure-activity relationship, and selective antitumor activity. J Med Chem 57:8307-18 (2014)  
Target
Name:
Isocitrate dehydrogenase [NADP] cytoplasmic
Synonyms:
Cytosolic NADP-isocitrate dehydrogenase IDH1 IDP Isocitrate dehydrogenase 1 (IDH1) Oxalosuccinate decarboxylase | PICD
Type:
Protein
Mol. Mass.:
46661.29
Organism:
Homo sapiens (Human)
Description:
O75874
Residue:
414
  
Inhibitor
Name:
BDBM50029479
Synonyms:
CHEMBL3343455
Type:
Small organic molecule
Emp. Form.:
C11H11NO2S
Mol. Mass.:
221.276
SMILES:
Cc1cc(Cc2ccsc2)n(O)c(=O)c1
: