Target
Isocitrate dehydrogenase [NADP] cytoplasmic
Ligand
BDBM50029489
Substrate
Meas. Tech.
ChEMBL_1436945 (CHEMBL3388443)
Ki
250±n/a nM
Citation
 Liu, ZYao, YKogiso, MZheng, BDeng, LQiu, JJDong, SLv, HGallo, JMLi, XNSong, Y Inhibition of cancer-associated mutant isocitrate dehydrogenases: synthesis, structure-activity relationship, and selective antitumor activity. J Med Chem 57:8307-18 (2014)  
Target
Name:
Isocitrate dehydrogenase [NADP] cytoplasmic
Synonyms:
Cytosolic NADP-isocitrate dehydrogenase IDH1 IDP Isocitrate dehydrogenase 1 (IDH1) Oxalosuccinate decarboxylase | PICD
Type:
Protein
Mol. Mass.:
46661.29
Organism:
Homo sapiens (Human)
Description:
O75874
Residue:
414
  
Inhibitor
Name:
BDBM50029489
Synonyms:
CHEMBL3343463
Type:
Small organic molecule
Emp. Form.:
C19H17NO3
Mol. Mass.:
307.3432
SMILES:
Cc1cc(Cc2ccc(cc2)-c2ccc(O)cc2)n(O)c(=O)c1
: