Target
Cannabinoid receptor 1
Ligand
BDBM50029973
Substrate
Meas. Tech.
ChEMBL_1438383 (CHEMBL3383058)
Ki
>10000±n/a nM
Citation
 Lucchesi, VHurst, DPShore, DMBertini, SEhrmann, BMAllarà, MLawrence, LLigresti, AMinutolo, FSaccomanni, GSharir, HMacchia, MDi Marzo, VAbood, MEReggio, PHManera, C CB2-selective cannabinoid receptor ligands: synthesis, pharmacological evaluation, and molecular modeling investigation of 1,8-Naphthyridin-2(1H)-one-3-carboxamides. J Med Chem 57:8777-91 (2014)  
Target
Name:
Cannabinoid receptor 1
Synonyms:
CANN6 CB-R CNR CNR1_HUMAN Cannabinoid receptor Cannabinoid receptor 1 (brain)
Type:
G Protein-Coupled Receptor (GPCR)
Mol. Mass.:
52868.96
Organism:
Homo sapiens (Human)
Description:
P21554
Residue:
472
  
Inhibitor
Name:
BDBM50029973
Synonyms:
CHEMBL3353447
Type:
Small organic molecule
Emp. Form.:
C29H27F2N3O2
Mol. Mass.:
487.5404
SMILES:
CC1CCC(CC1)NC(=O)c1cc2cc(cnc2n(Cc2ccc(F)cc2)c1=O)-c1ccc(F)cc1
: