Target
Cannabinoid receptor 2
Ligand
BDBM50258570
Substrate
Meas. Tech.
ChEMBL_1438384 (CHEMBL3383059)
Ki
1.9±n/a nM
Citation
 Lucchesi, VHurst, DPShore, DMBertini, SEhrmann, BMAllarà, MLawrence, LLigresti, AMinutolo, FSaccomanni, GSharir, HMacchia, MDi Marzo, VAbood, MEReggio, PHManera, C CB2-selective cannabinoid receptor ligands: synthesis, pharmacological evaluation, and molecular modeling investigation of 1,8-Naphthyridin-2(1H)-one-3-carboxamides. J Med Chem 57:8777-91 (2014)  
Target
Name:
Cannabinoid receptor 2
Synonyms:
CANNABINOID CB2 CB2 CB2B CNR2_HUMAN Cannabinoid CB2 receptor Cannabinoid receptor 2 (CB2R) | hCB2
Type:
G Protein-Coupled Receptor (GPCR)
Mol. Mass.:
39690.94
Organism:
Homo sapiens (Human)
Description:
P34972
Residue:
360
  
Inhibitor
Name:
BDBM50258570
Synonyms:
CHEMBL466223 | N-(4-Methylcyclohexyl)-1-(2-morpholin-4-ylethyl)-1,8-naphthyridin-2(1H)-on-3-carboxamide
Type:
Small organic molecule
Emp. Form.:
C22H30N4O3
Mol. Mass.:
398.4986
SMILES:
CC1CCC(CC1)NC(=O)c1cc2cccnc2n(CCN2CCOCC2)c1=O
: