Target
NAD-dependent protein deacetylase sirtuin-2
Ligand
BDBM50030105
Substrate
Meas. Tech.
ChEMBL_1438397 (CHEMBL3383626)
IC50
489±n/a nM
Citation
 Cui, HKamal, ZAi, TXu, YMore, SSWilson, DJChen, L Discovery of potent and selective sirtuin 2 (SIRT2) inhibitors using a fragment-based approach. J Med Chem 57:8340-57 (2014)  
Target
Name:
NAD-dependent protein deacetylase sirtuin-2
Synonyms:
NAD-Dependent Deacetylase Sirtuin-2 NAD-dependent deacetylase sirtuin 3 SIR2-like SIR2L SIR2_HUMAN Sirtuin 2 (SIRT2)
Type:
Hydrolase
Mol. Mass.:
43172.62
Organism:
Homo sapiens (Human)
Description:
Residue:
389
  
Inhibitor
Name:
BDBM50030105
Synonyms:
CHEMBL3343534
Type:
Small organic molecule
Emp. Form.:
C24H19N3O3
Mol. Mass.:
397.426
SMILES:
Cc1ccc(cc1)C(=O)Nc1cccc2cc(Oc3cncc(c3)C(N)=O)ccc12
: