Target
NAD-dependent protein deacetylase sirtuin-1
Ligand
BDBM50030169
Substrate
Meas. Tech.
ChEMBL_1438396 (CHEMBL3383625)
IC50
13500±n/a nM
Citation
 Cui, HKamal, ZAi, TXu, YMore, SSWilson, DJChen, L Discovery of potent and selective sirtuin 2 (SIRT2) inhibitors using a fragment-based approach. J Med Chem 57:8340-57 (2014)  
Target
Name:
NAD-dependent protein deacetylase sirtuin-1
Synonyms:
NAD-Dependent Deacetylase Sirtuin-1 NAD-dependent protein deacetylase sirtuin-1 (SIRT1) SIR2-like protein 1 SIRT1 Sirtuin-1 (SIRT1) | hSIR2
Type:
Developmental protein; hydrolase
Mol. Mass.:
81626.66
Organism:
Homo sapiens (Human)
Description:
Residue:
747
  
Inhibitor
Name:
BDBM50030169
Synonyms:
CHEMBL3343525
Type:
Small organic molecule
Emp. Form.:
C16H12N2O2
Mol. Mass.:
264.2787
SMILES:
NC(=O)c1cncc(Oc2ccc3ccccc3c2)c1
: