Target
Muscarinic acetylcholine receptor M4
Ligand
BDBM50030224
Substrate
Meas. Tech.
ChEMBL_1438416 (CHEMBL3383645)
Ki
1.1±n/a nM
Citation
 Bonifazi, AYano, HDel Bello, FFarande, AQuaglia, WPetrelli, RMatucci, RNesi, MVistoli, GFerré, SPiergentili, A Synthesis and biological evaluation of a novel series of heterobivalent muscarinic ligands based on xanomeline and 1-[3-(4-butylpiperidin-1-yl)propyl]-1,2,3,4-tetrahydroquinolin-2-one (77-LH-28-1). J Med Chem 57:9065-77 (2014)  
Target
Name:
Muscarinic acetylcholine receptor M4
Synonyms:
ACM4_HUMAN Cholinergic, muscarinic M4 Muscarinic acetylcholine receptor M2 and M4
Type:
Enzyme Catalytic Domain
Mol. Mass.:
53079.31
Organism:
Homo sapiens (Human)
Description:
Cholinergic, muscarinic M4 CHRM4 HUMAN M3::P08173
Residue:
479
  
Inhibitor
Name:
BDBM50030224
Synonyms:
CHEMBL3354069
Type:
Small organic molecule
Emp. Form.:
C34H51N5O2S
Mol. Mass.:
593.866
SMILES:
CN1CCC=C(C1)c1nsnc1OCCCCCCCCCC1CCN(CCCN2C(=O)CCc3ccccc23)CC1
: