Target
Genome polyprotein
Ligand
BDBM50030457
Substrate
Meas. Tech.
ChEMBL_1434210 (CHEMBL3384588)
IC50
380±n/a nM
Citation
 Bhakat, SKarubiu, WJayaprakash, VSoliman, ME A perspective on targeting non-structural proteins to combat neglected tropical diseases: Dengue, West Nile and Chikungunya viruses. Eur J Med Chem 87:677-702 (2014)  
Target
Name:
Genome polyprotein
Synonyms:
POLG_WNV | polyprotein precursor
Type:
PROTEIN
Mol. Mass.:
380170.63
Organism:
West Nile virus
Description:
ChEMBL_1438217
Residue:
3430
  
Inhibitor
Name:
BDBM50030457
Synonyms:
CHEMBL3344314
Type:
Small organic molecule
Emp. Form.:
C22H42N8O5
Mol. Mass.:
498.6195
SMILES:
NCCCC[C@H](NC(=O)[C@H](CCCCN)NC(=O)C1CC1)C(=O)N[C@@H](CCCNC(N)=N)C(O)=O
: