Target
Genome polyprotein
Ligand
BDBM50030459
Substrate
Meas. Tech.
ChEMBL_1434210 (CHEMBL3384588)
Ki
130±n/a nM
Citation
 Bhakat, SKarubiu, WJayaprakash, VSoliman, ME A perspective on targeting non-structural proteins to combat neglected tropical diseases: Dengue, West Nile and Chikungunya viruses. Eur J Med Chem 87:677-702 (2014)  
Target
Name:
Genome polyprotein
Synonyms:
POLG_WNV | polyprotein precursor
Type:
PROTEIN
Mol. Mass.:
380170.63
Organism:
West Nile virus
Description:
ChEMBL_1438217
Residue:
3430
  
Inhibitor
Name:
BDBM50030459
Synonyms:
CHEMBL3344321
Type:
Small organic molecule
Emp. Form.:
C28H46Cl2N8O3
Mol. Mass.:
613.623
SMILES:
NCCCC[C@H](NC(=O)[C@H](CCCCN)NC(=O)Cc1ccc(Cl)c(Cl)c1)C(=O)NC[C@H]1CC[C@@H](CC1)NC(N)=N
: