Target
Nuclear receptor subfamily 1 group I member 2
Ligand
BDBM50445877
Substrate
Meas. Tech.
ChEMBL_1434945 (CHEMBL3385882)
EC50
260±n/a nM
Citation
 Gege, CSchlüter, THoffmann, T Identification of the first inverse agonist of retinoid-related orphan receptor (ROR) with dual selectivity for RORß and ROR¿t. Bioorg Med Chem Lett 24:5265-7 (2014)  
Target
Name:
Nuclear receptor subfamily 1 group I member 2
Synonyms:
NR1I2 Orphan nuclear receptor PAR1 PXR SXR nuclear receptor subfamily 1 group I member 2 isoform 1
Type:
Nuclear receptor
Mol. Mass.:
49774.77
Organism:
Homo sapiens (Human)
Description:
O75469
Residue:
434
  
Inhibitor
Name:
BDBM50445877
Synonyms:
CHEMBL3105681
Type:
Small organic molecule
Emp. Form.:
C26H20Cl2N2O4S2
Mol. Mass.:
559.484
SMILES:
CCS(=O)(=O)c1ccc(CC(=O)Nc2nc(c(s2)C(=O)c2ccccc2Cl)-c2cccc(Cl)c2)cc1
: