Target
Nuclear receptor subfamily 1 group I member 2
Ligand
BDBM50030477
Substrate
Meas. Tech.
ChEMBL_1434945 (CHEMBL3385882)
EC50
80±n/a nM
Citation
 Gege, CSchlüter, THoffmann, T Identification of the first inverse agonist of retinoid-related orphan receptor (ROR) with dual selectivity for RORß and ROR¿t. Bioorg Med Chem Lett 24:5265-7 (2014)  
Target
Name:
Nuclear receptor subfamily 1 group I member 2
Synonyms:
NR1I2 Orphan nuclear receptor PAR1 PXR SXR nuclear receptor subfamily 1 group I member 2 isoform 1
Type:
Nuclear receptor
Mol. Mass.:
49774.77
Organism:
Homo sapiens (Human)
Description:
O75469
Residue:
434
  
Inhibitor
Name:
BDBM50030477
Synonyms:
CHEBI:77317 SR-12813
Type:
Small organic molecule
Emp. Form.:
C24H42O7P2
Mol. Mass.:
504.5336
SMILES:
[#6]-[#6]-[#8]P(=O)([#8]-[#6]-[#6])[#6](=[#6]\c1cc(c(-[#8])c(c1)C([#6])([#6])[#6])C([#6])([#6])[#6])\P(=O)([#8]-[#6]-[#6])[#8]-[#6]-[#6]
: